{"text_format":"1","workbook":"xlsx","n_sheets":3,"sheets":["Data","Notes","staticData"],"not_rendered":{"charts":0,"images":0,"macros":1,"external_links":0,"defined_names":3,"comments":0,"pivot_tables":0},"unopened":[],"bounds":{"document_bytes":16777216,"sheet_cells":100000,"rows_first":2000,"rows_last":500,"rows_between":2000,"halvings":0,"cell_chars":16384,"cell_head_chars":4096},"cells_cut":0,"cells_raw":0,"read":"whole","date_system":"1900"}

{"sheet":"Data","index":0,"n_rows":33,"n_cols":16,"rows_kept":33,"cut":false,"hidden":false,"merged":[[0,9,2,12],[0,8,1,8]]}
[null,null,null,"Choose Server","Kansas City, Mo","Query Selected","getopenorders",null,"Description of macro",{"$f":"IFERROR(INDEX(staticData!F2:F100,MATCH(G1,staticData!D2:D100,0)),\"Missing description contact support\")","v":"Returns open orders based on day count sent over, sDay 15 days in the past eDay 5 days in the future, can be left empty for this default days"}]
[null,null,null,{"$f":"IFERROR(_xlfn.TEXTSPLIT(INDEX(staticData!G2:G100,MATCH(G1,staticData!D2:D100,0)),\",\"),\"\")","v":"sDay"},"eDay"]
[]
[]
["plantToken","customerItemNumber","article","articleDescription","releaseNumber","header","customerLineItemNo","customerReleaseNumber","pallets","qty","cartons","customerID","DeliveryAddressDescription","loadingDate","deliveryDate","Remark"]
["usksc1","114672",224,"114672 CAP Coconut OGX 53.55mm gold ",1071,"4500428636","4500428636","4500428636",16,518400,576,56,"Tri Tech Laboratores, LLC","2025-05-06","2025-05-09",""]
["usksc1","96858584",186,"96858584 CAP PP P&G 250ml Swan Color blue",1143,"12310-21","12310-21","12310-21",7.3056000000000001,236700,263,66,"TECHNIMARK LLC\r\r\nBUILDING 900-RIGIDS\r\r\nINWOOD,WEST VIRGINIA,25428\r\r\n","2025-05-08","2025-05-09",""]
["usksc1","CF-20026",250,"CF-20026 CAP CCL 1 1/2\" OF .187 white",220,"5085672","5085672","5085672",3.5,75600,63,7,"CCL Tube (Wilkes-Barre), Inc.\r\r\nPlastic Division ","2025-05-09","2025-05-10",""]
["usksc1","CF-20026",250,"CF-20026 CAP CCL 1 1/2\" OF .187 white",165,"5085291","5085291","5085291",2.9443999999999999,63600,53,7,"CCL Tube (Wilkes-Barre), Inc.\r\r\nPlastic Division ","2025-05-09","2025-05-10",""]
["usksc1","CF-20026",250,"CF-20026 CAP CCL 1 1/2\" OF .187 white",1100,"5086092","5086092","5086092",2.8332999999999999,61200,51,7,"CCL Tube (Wilkes-Barre), Inc.\r\r\nPlastic Division ","2025-05-09","2025-05-10",""]
["usksc1","CU-20025",134,"CU-20025 CAP CCL 7/8\" RIB white",1059,"175244","175244","175244",0.44440000000000002,88000,8,4,"CCL Tube - Carson","2025-05-09","2025-05-13",""]
["usksc1","PP",33,"PP Resin",1165,"","051225","051225",14.7059,10000,14.7059,65,"St. Joseph Plastics","2025-05-13","2025-05-13",""]
["usksc1","PP",33,"PP Resin",1166,"","051225","051225",14.7059,10000,14.7059,65,"St. Joseph Plastics","2025-05-13","2025-05-13",""]
["usksc1","PP",33,"PP Resin",1167,"","051225","051225",14.7059,10000,14.7059,65,"St. Joseph Plastics","2025-05-13","2025-05-13",""]
["usksc1","PP",34,"PP Lumps",1169,"051325","051325","051325",14.7059,10000,14.7059,65,"St. Joseph Plastics","2025-05-13","2025-05-13",""]
["usksc1","8330883",215,"8330883 CAP RB-USA Lysol 80ct fat-cat Color transparent",625,"2360598","2360598","2360598",30,178200,1080,16,"Duke Warehouse","2025-05-13","2025-05-14",""]
["usksc1","PP",33,"PP Resin",1172,"051425","051425","051425",14.7059,10000,14.7059,65,"St. Joseph Plastics","2025-05-14","2025-05-14",""]
["usksc1","PP",34,"PP Lumps",1174,"051425","051425","051425",14.7059,10000,14.7059,65,"St. Joseph Plastics","2025-05-14","2025-05-14",""]
["usksc1","21183433",219,"21183433 CAP P&G 90ml Apothecary Travel size Color green",1161,"N6P-5500009856","N6P-5500009856","N6P-5500009856",1,32400,18,10,"Procter & Gamble Co.\r\r\nIC Plant 2200 Lower Muscatine Road","2025-05-12","2025-05-16",""]
["usksc1","PP",34,"PP Lumps",1195,"051625","051625","051625",14.7059,10000,14.7059,65,"St. Joseph Plastics","2025-05-16","2025-05-16",""]
["usksc1","PP",33,"PP Resin",1194,"051625","051625","051625",14.7059,10000,14.7059,65,"St. Joseph Plastics","2025-05-16","2025-05-16",""]
["usksc1","CF-20027",137,"CF-20027 CAP CCL 1 1/2\" OF .250 white",1134,"5085647","5085647","5085647",0.66669999999999996,14400,12,7,"CCL Tube (Wilkes-Barre), Inc.\r\r\nPlastic Division ","2025-05-16","2025-05-17",""]
["usksc1","21183433",219,"21183433 CAP P&G 90ml Apothecary Travel size Color green",1157,"N6P-5500009856","N6P-5500009856","N6P-5500009856",2,64800,36,10,"Procter & Gamble Co.\r\r\nIC Plant 2200 Lower Muscatine Road","2025-05-14","2025-05-18",""]
["usksc1","PP",34,"PP Lumps",1204,"051925","051925","051925",14.7059,10000,14.7059,65,"St. Joseph Plastics","2025-05-19","2025-05-19",""]
["usksc1","8330883",215,"8330883 CAP RB-USA Lysol 80ct fat-cat Color transparent",633,"2360606","2360606","2360606",30,178200,1080,16,"Duke Warehouse","2025-05-19","2025-05-20",""]
["usksc1","8330883",215,"8330883 CAP RB-USA Lysol 80ct fat-cat Color transparent",634,"2360607","2360607","2360607",30,178200,1080,16,"Duke Warehouse","2025-05-20","2025-05-21",""]
["usksc1","8330883",215,"8330883 CAP RB-USA Lysol 80ct fat-cat Color transparent",635,"2360608","2360608","2360608",30,178200,1080,16,"Duke Warehouse","2025-05-21","2025-05-22",""]
["usksc1","99545777",178,"99545777 CAP Olay 18oz  purple",1206,"N6P-5500009856","N6P-5500009856","N6P-5500009856",2,35712,72,10,"Procter & Gamble Co.\r\r\nIC Plant 2200 Lower Muscatine Road","2025-05-19","2025-05-23",""]
["usksc1","8330883",215,"8330883 CAP RB-USA Lysol 80ct fat-cat Color transparent",636,"2360609","2360609","2360609",30,178200,1080,16,"Duke Warehouse","2025-05-23","2025-05-24",""]
["usksc1","203130",481,"203130 CAP Mentos 52.5 red mixed fruit",852,"4500478667","00030","00030",30,675000,900,14,"Showcase JIT Warehouse","2025-05-23","2025-05-24",""]
["usksc1","CF-20603",374,"CF-20603 CAP CCL 1 3/16\" FT .187 blue",1061,"5087282","5087282","5087282",1.5556000000000001,78400,28,7,"CCL Tube (Wilkes-Barre), Inc.\r\r\nPlastic Division ","2025-05-23","2025-05-24",""]
["usksc1","CU-20035",141,"CU-20035 CAP CCL 1\" SM white",1177,"5087333","5087333","5087333",0.27779999999999999,32500,5,7,"CCL Tube (Wilkes-Barre), Inc.\r\r\nPlastic Division ","2025-05-23","2025-05-24",""]
["usksc1","SAV",190,"SAV CAP PP 24mm Black Rain",987,"136208","136208","136208",15,298080,540,30,"ABACO PARTNERS, LLC dba SUREFILL","2025-05-21","2025-05-24",""]

{"sheet":"Notes","index":1,"n_rows":15,"n_cols":11,"rows_kept":15,"cut":false,"hidden":false,"merged":[[2,10,6,14],[0,0,0,3],[8,10,12,14],[14,10,18,14],[0,4,4,8],[0,10,0,14],[6,4,6,8],[7,4,8,8]]}
["Instructions",null,null,null,"Please save a copy as several users will edit this file ",null,null,null,null,null,"Notes"]
[1,"Select your plant"]
[2,"Select the query you would like to pull.",null,null,null,null,null,null,null,null,"If you receive an error from the get data please send  a screen shot with what query you were pulling so this can be addressed"]
[3,"Press get data"]
[]
[]
[null,null,null,null,"Description of query"]
[null,null,null,null,{"$f":"IFERROR(INDEX(staticData!F2:F100,MATCH(Data!G1,staticData!D2:D100,0)),\"Missing description contact support\")","v":"Returns open orders based on day count sent over, sDay 15 days in the past eDay 5 days in the future, can be left empty for this default days"}]
[null,null,null,null,null,null,null,null,null,null,"Make sure you do not create formulas or anything in the data tab, the entire sheet will be cleared on each data pull, please reference the data on another sheet."]
[]
[]
[]
[]
[]
[null,null,null,null,null,null,null,null,null,null,"If you change the name or delete the data tab it will be recreated and the data will populate in the data tab only"]

{"sheet":"staticData","index":2,"n_rows":20,"n_cols":9,"rows_kept":20,"cut":false,"hidden":false,"merged":[]}
["All","Server",null,"name","endpoint","description","Critiera","sheetversion",2.7]
["Bethlehem, PA","USBET1VMS006",null,"getActiveAv","/api/datamart/getarticles","Gets all current active AV, with specific critiera."," "]
["Bowling Green 1, Kentucky","USBOW1VMS006",null,"getCustomerInventory","/api/datamart/getcustomerinventory","Returns specific customer inventory based on there address ID.","customer"]
["Bowling Green 2, Kentucky","USBOW2VMS006",null,"getopenorders","/api/datamart/getopenorders","Returns open orders based on day count sent over, sDay 15 days in the past eDay 5 days in the future, can be left empty for this default days","sDay,eDay"]
["Dayton, Ohio","USDAY1VMS006",null,"getinventory","/api/datamart/getinventory","Returns all inventory,  excludes inv locations. no running numbers","includeRunnningNumbers"]
["Florence, Kentucky","USFLO1VMS006",null,"getSiloAdjustment","/api/logistics/getsilosdjustment","Returns all siloadjustments in selected date range IE: 1/1/2025 to 1/31/2025","startDate,endDate"]
["Houston, Texas","USHOU1VMS006",null,"Delivery by date trange","/api/datamart/deliverybydaterange","Returns all Deliverys in selected date range IE: 1/1/2025 to 1/31/2025","start,end"]
["Iowa EBM, Iowa","USIOW1VMS006",null,"Fake Edi Update","/api/datamart/fakeediupdate","Returns all open orders to correct and resubmit, leaving blank will get everything putting an address only returns the specified address","address"]
["Iowa ISBM, Iowa","USIOW1VMS006",null,"Address Corrections","/api/datamart/getaddressdata","Returns all addresses that will not process correctly in tms due to incorrect city state setup.","sDay,eDay"]
["Jefferson City, Missouri","USJCI1VMS006",null,null,null,"Returns all lots starting later than today and has a pkg that is missing layouts.","includeRunnningNumbers"]
["Kansas City, Mo","USKSC1VMS006",null,null,null,"Returns all inventory,  excludes inv locations. no running numbers","customer"]
["Lima, Ohio","USLIM1VMS006",null,null,null,"Returns all orders based on customer id, leaving empty will pull everythinng in.","customer"]
["Marked Tree, AR","USMAR1VMS006",null,null,null,"Returns all siloadjustments in range","startDate,endDate"]
["McDonough, Georgia","USMCD1VMS006"]
["Salt Lake City, Utah","USSLC1VMS006"]
["Sherman, Texas","USSHE1VMS006"]
["St. Peters, Missouri","USSTP1VMS006"]
["West Bend, Wisconsin","USWEB1VMS006"]
["Dev Server","localhost"]
["TestServer","USMCD1VMS036"]